Target
Fatty-acid amide hydrolase 1 [30-579]
Ligand
BDBM50153354
Substrate
Meas. Tech.
ChEMBL_1562611 (CHEMBL3779260)
IC50
5.0±n/a nM
Citation
 Migliore, MHabrant, DSasso, OAlbani, CBertozzi, SMArmirotti, APiomelli, DScarpelli, R Potent multitarget FAAH-COX inhibitors: Design and structure-activity relationship studies. Eur J Med Chem 109:216-37 (2016)  
Target
Name:
Fatty-acid amide hydrolase 1 [30-579]
Synonyms:
Anandamide amidohydrolase 1 Faah Fatty Acid Amide Hydrolase Fatty-acid amide hydrolase (FAAH) Fatty-acid amide hydrolase 1 (FAAH) Oleamide hydrolase 1
Type:
Single-pass membrane protein; homodimer
Mol. Mass.:
60474.00
Organism:
Rattus norvegicus (rat)
Description:
P97612 (aa 30-579)
Residue:
550
  
Inhibitor
Name:
BDBM50153354
Synonyms:
CHEMBL3775510
Type:
Small organic molecule
Emp. Form.:
C23H26F3NO4
Mol. Mass.:
437.452
SMILES:
CCCCCCNC(=O)Oc1cccc(c1)-c1ccc(cc1C(F)(F)F)C(C)C(O)=O
: