Target
Fatty-acid amide hydrolase 1 [30-579]
Ligand
BDBM50153360
Substrate
Meas. Tech.
ChEMBL_1562611 (CHEMBL3779260)
IC50
9.4±n/a nM
Citation
 Migliore, MHabrant, DSasso, OAlbani, CBertozzi, SMArmirotti, APiomelli, DScarpelli, R Potent multitarget FAAH-COX inhibitors: Design and structure-activity relationship studies. Eur J Med Chem 109:216-37 (2016)  
Target
Name:
Fatty-acid amide hydrolase 1 [30-579]
Synonyms:
Anandamide amidohydrolase 1 Faah Fatty Acid Amide Hydrolase Fatty-acid amide hydrolase (FAAH) Fatty-acid amide hydrolase 1 (FAAH) Oleamide hydrolase 1
Type:
Single-pass membrane protein; homodimer
Mol. Mass.:
60474.00
Organism:
Rattus norvegicus (rat)
Description:
P97612 (aa 30-579)
Residue:
550
  
Inhibitor
Name:
BDBM50153360
Synonyms:
CHEMBL3774784
Type:
Small organic molecule
Emp. Form.:
C22H26FNO4
Mol. Mass.:
387.4445
SMILES:
CCCCCCNC(=O)Oc1cccc(c1)-c1ccc(cc1F)[C@H](C)C(O)=O
: