Target
Prostaglandin G/H synthase 2
Ligand
BDBM50153446
Substrate
Meas. Tech.
ChEMBL_1562613 (CHEMBL3779451)
IC50
240±n/a nM
Citation
 Migliore, MHabrant, DSasso, OAlbani, CBertozzi, SMArmirotti, APiomelli, DScarpelli, R Potent multitarget FAAH-COX inhibitors: Design and structure-activity relationship studies. Eur J Med Chem 109:216-37 (2016)  
Target
Name:
Prostaglandin G/H synthase 2
Synonyms:
COX2 Cyclooxygenase 2 (COX-2) Cyclooxygenase-2 (COX-2 AA) Cyclooxygenase-2 (COX-2) PGH2_HUMAN PHS II Prostaglandin E synthase/G/H synthase 2 Prostaglandin-endoperoxide synthase 2
Type:
Enzyme
Mol. Mass.:
69003.89
Organism:
Homo sapiens (Human)
Description:
Recombinant Cox-2 provided by Cayman (Cayman Chemical Co.,Ann Arbor, MI).
Residue:
604
  
Inhibitor
Name:
BDBM50153446
Synonyms:
CHEMBL3775770 | US9630914, Example 16
Type:
Small organic molecule
Emp. Form.:
C21H24FNO4
Mol. Mass.:
373.418
SMILES:
CCCCCCNC(=O)Oc1cccc(c1)-c1ccc(CC(O)=O)cc1F
: