Target
Lysine-specific histone demethylase 1A
Ligand
BDBM50153591
Substrate
Meas. Tech.
ChEMBL_1561095 (CHEMBL3776819)
IC50
<100±n/a nM
Citation
 Blass, B Cyclopropanamine Compounds and Use Thereof. ACS Med Chem Lett 7:10-1 (2016)  
Target
Name:
Lysine-specific histone demethylase 1A
Synonyms:
AOF2 Flavin-containing amine oxidase domain-containing protein 2 KDM1A KIAA0601 Lysine-specific demethylase 1 (LSD1) Lysine-specific histone demethylase 1 (LSD1)
Type:
Enzyme
Mol. Mass.:
92901.01
Organism:
Homo sapiens (Human)
Description:
O60341
Residue:
852
  
Inhibitor
Name:
BDBM50153591
Synonyms:
CHEMBL3775711 US10414761, Example 99 US9487511, 99 US9920047, 99
Type:
Small organic molecule
Emp. Form.:
C16H20N4OS2
Mol. Mass.:
348.486
SMILES:
Cc1nnc(NC(=O)c2cc([C@@H]3C[C@H]3NC3CCC3)c(C)s2)s1
: