Target
Proto-oncogene tyrosine-protein kinase receptor Ret
Ligand
BDBM50153900
Substrate
Meas. Tech.
ChEMBL_1560166 (CHEMBL3778237)
IC50
21±n/a nM
Citation
 Newton, RBowler, KABurns, EMChapman, PJFairweather, EEFritzl, SJGoldberg, KMHamilton, NMHolt, SVHopkins, GVJones, SDJordan, AMLyons, AJNikki March, HMcDonald, NQMaguire, LAMould, DPPurkiss, AGSmall, HFStowell, AIThomson, GJWaddell, IDWaszkowycz, BWatson, AJOgilvie, DJ The discovery of 2-substituted phenol quinazolines as potent RET kinase inhibitors with improved KDR selectivity. Eur J Med Chem 112:20-32 (2016)  
Target
Name:
Proto-oncogene tyrosine-protein kinase receptor Ret
Synonyms:
CDHF12 Cadherin family member 12 Proto-oncogene c-Ret RET51 Tyrosine-protein kinase Ret (RET)
Type:
Protein
Mol. Mass.:
124318.29
Organism:
Homo sapiens (Human)
Description:
P07949
Residue:
1114
  
Inhibitor
Name:
BDBM50153900
Synonyms:
CHEMBL3774913
Type:
Small organic molecule
Emp. Form.:
C17H16FN3O3
Mol. Mass.:
329.3256
SMILES:
COc1cc2ncnc(Nc3cc(F)cc(O)c3C)c2cc1OC
: