Target
Proto-oncogene tyrosine-protein kinase receptor Ret
Ligand
BDBM50154010
Substrate
Meas. Tech.
ChEMBL_1560166 (CHEMBL3778237)
IC50
10.0±n/a nM
Citation
 Newton, RBowler, KABurns, EMChapman, PJFairweather, EEFritzl, SJGoldberg, KMHamilton, NMHolt, SVHopkins, GVJones, SDJordan, AMLyons, AJNikki March, HMcDonald, NQMaguire, LAMould, DPPurkiss, AGSmall, HFStowell, AIThomson, GJWaddell, IDWaszkowycz, BWatson, AJOgilvie, DJ The discovery of 2-substituted phenol quinazolines as potent RET kinase inhibitors with improved KDR selectivity. Eur J Med Chem 112:20-32 (2016)  
Target
Name:
Proto-oncogene tyrosine-protein kinase receptor Ret
Synonyms:
CDHF12 Cadherin family member 12 Proto-oncogene c-Ret RET51 Tyrosine-protein kinase Ret (RET)
Type:
Protein
Mol. Mass.:
124318.29
Organism:
Homo sapiens (Human)
Description:
P07949
Residue:
1114
  
Inhibitor
Name:
BDBM50154010
Synonyms:
CHEMBL3775903
Type:
Small organic molecule
Emp. Form.:
C16H14FN3O3
Mol. Mass.:
315.2991
SMILES:
COc1cc2ncnc(Nc3cccc(O)c3F)c2cc1OC
: