Target
Vascular endothelial growth factor receptor 2
Ligand
BDBM4627
Substrate
Meas. Tech.
ChEMBL_1560167 (CHEMBL3778238)
IC50
2.3±n/a nM
Citation
 Newton, RBowler, KABurns, EMChapman, PJFairweather, EEFritzl, SJGoldberg, KMHamilton, NMHolt, SVHopkins, GVJones, SDJordan, AMLyons, AJNikki March, HMcDonald, NQMaguire, LAMould, DPPurkiss, AGSmall, HFStowell, AIThomson, GJWaddell, IDWaszkowycz, BWatson, AJOgilvie, DJ The discovery of 2-substituted phenol quinazolines as potent RET kinase inhibitors with improved KDR selectivity. Eur J Med Chem 112:20-32 (2016)  
Target
Name:
Vascular endothelial growth factor receptor 2
Synonyms:
CD_antigen=CD309 Fetal liver kinase 1 (FLK-1) KDR Protein-tyrosine kinase receptor Flk-1 VEGFR-2 VEGFR2 Vascular Endothelial Growth Factor Receptor Kinase 2 Vascular endothelial growth factor receptor 2 (KDR) Vascular endothelial growth factor receptor 2 (VEGFR2) Vascular endothelial growth factor receptor-2 (VEGFR-2)
Type:
Receptor Tyrosine Kinase
Mol. Mass.:
151510.97
Organism:
Homo sapiens (Human)
Description:
P35968
Residue:
1356
  
Inhibitor
Name:
BDBM4627
Synonyms:
5-[(6,7-dimethoxyquinazolin-4-yl)amino]-4-fluoro-2-methylphenol | Anilinoquinazoline deriv. 10
Type:
Small organic molecule
Emp. Form.:
C17H16FN3O3
Mol. Mass.:
329.3256
SMILES:
COc1cc2ncnc(Nc3cc(O)c(C)cc3F)c2cc1OC
: