Target
Kinesin-1 heavy chain/Proto-oncogene tyrosine-protein kinase receptor Ret
Ligand
BDBM4622
Substrate
Meas. Tech.
ChEMBL_1560169 (CHEMBL3778240)
IC50
380±n/a nM
Citation
 Newton, RBowler, KABurns, EMChapman, PJFairweather, EEFritzl, SJGoldberg, KMHamilton, NMHolt, SVHopkins, GVJones, SDJordan, AMLyons, AJNikki March, HMcDonald, NQMaguire, LAMould, DPPurkiss, AGSmall, HFStowell, AIThomson, GJWaddell, IDWaszkowycz, BWatson, AJOgilvie, DJ The discovery of 2-substituted phenol quinazolines as potent RET kinase inhibitors with improved KDR selectivity. Eur J Med Chem 112:20-32 (2016)  
Target
Name:
Kinesin-1 heavy chain/Proto-oncogene tyrosine-protein kinase receptor Ret
Synonyms:
Kinesin-1 heavy chain/ Tyrosine-protein kinase receptor RET
Type:
Mol. Mass.:
Description:
ASSAY_ID of ChEMBL is 1972971
Components:
This complex has 2 components.
Component 1
Name:
Proto-oncogene tyrosine-protein kinase receptor Ret
Synonyms:
CDHF12 Cadherin family member 12 Proto-oncogene c-Ret RET51 Tyrosine-protein kinase Ret (RET)
Type:
Protein
Mol. Mass.:
124318.29
Organism:
Homo sapiens (Human)
Description:
P07949
Residue:
1114
  
Component 2
Name:
Kinesin-1 heavy chain
Synonyms:
KIF5B KNS | KNS1
Type:
PROTEIN
Mol. Mass.:
109682.61
Organism:
Homo sapiens (Human)
Description:
ChEMBL_770435
Residue:
963
  
Inhibitor
Name:
BDBM4622
Synonyms:
3-[(6,7-dimethoxyquinazolin-4-yl)amino]phenol CHEMBL127907
Type:
Small organic molecule
Emp. Form.:
C16H15N3O3
Mol. Mass.:
297.3086
SMILES:
COc1cc2ncnc(Nc3cccc(O)c3)c2cc1OC
: