Target
Liver carboxylesterase 1
Ligand
BDBM50154558
Substrate
Meas. Tech.
ChEMBL_1561177 (CHEMBL3777370)
IC50
12310±n/a nM
Citation
 Zou, LWLi, YGWang, PZhou, KHou, JJin, QHao, DCGe, GBYang, L Design, synthesis, and structure-activity relationship study of glycyrrhetinic acid derivatives as potent and selective inhibitors against human carboxylesterase 2. Eur J Med Chem 112:280-8 (2016)  
Target
Name:
Liver carboxylesterase 1
Synonyms:
Acyl coenzyme A:cholesterol acyltransferase CES1 EST1_HUMAN Serine hydrolase (CES1)
Type:
Protein
Mol. Mass.:
62520.83
Organism:
Homo sapiens (Human)
Description:
Residue:
567
  
Inhibitor
Name:
BDBM50154558
Synonyms:
CHEMBL3775320
Type:
Small organic molecule
Emp. Form.:
C36H57NO5
Mol. Mass.:
583.8415
SMILES:
[H][C@@]12C[C@](C)(CC[C@]1(C)CC[C@]1(C)C2=CC(=O)[C@]2([H])[C@@]3(C)CC[C@H](OC(C)=O)C(C)(C)[C@]3([H])CC[C@@]12C)C(=O)OCCN(C)C
: