Target
Cocaine esterase
Ligand
BDBM50130915
Substrate
Meas. Tech.
ChEMBL_1561176 (CHEMBL3777369)
IC50
6110±n/a nM
Citation
 Zou, LWLi, YGWang, PZhou, KHou, JJin, QHao, DCGe, GBYang, L Design, synthesis, and structure-activity relationship study of glycyrrhetinic acid derivatives as potent and selective inhibitors against human carboxylesterase 2. Eur J Med Chem 112:280-8 (2016)  
Target
Name:
Cocaine esterase
Synonyms:
CES2 EST2_HUMAN | ICE
Type:
PROTEIN
Mol. Mass.:
61801.08
Organism:
Homo sapiens (Human)
Description:
ChEMBL_1494240
Residue:
559
  
Inhibitor
Name:
BDBM50130915
Synonyms:
CHEBI:3122 | CHEMBL1231178
Type:
Small organic molecule
Emp. Form.:
C12H9N2O8P
Mol. Mass.:
340.1822
SMILES:
OP(=O)(Oc1ccc(cc1)[N+]([O-])=O)Oc1ccc(cc1)[N+]([O-])=O
: