Target
Receptor-type tyrosine-protein kinase FLT3
Ligand
BDBM50154813
Substrate
Meas. Tech.
ChEMBL_1561419 (CHEMBL3779155)
IC50
2.1±n/a nM
Citation
 Tang, QWang, LTu, YZhu, WLuo, RTu, QWang, PWu, CGong, PZheng, P Discovery of novel pyrrolo[2,3-b]pyridine derivatives bearing 1,2,3-triazole moiety as c-Met kinase inhibitors. Bioorg Med Chem Lett 26:1680-4 (2016)  
Target
Name:
Receptor-type tyrosine-protein kinase FLT3
Synonyms:
CD135 FL cytokine receptor FLK2 FLT3 Fetal liver kinase-2 Fms-like tyrosine kinase 3 (Flt-3) STK-1 Stem cell tyrosine kinase 1
Type:
Enzyme
Mol. Mass.:
112888.62
Organism:
Homo sapiens (Human)
Description:
P36888
Residue:
993
  
Inhibitor
Name:
BDBM50154813
Synonyms:
CHEMBL3774451
Type:
Small organic molecule
Emp. Form.:
C23H13F5N6O2
Mol. Mass.:
500.3803
SMILES:
Fc1ccc(cc1)-n1nnc(C(=O)Nc2ccc(Oc3ccnc4[nH]ccc34)c(F)c2)c1C(F)(F)F
: