Target
Potassium voltage-gated channel subfamily H member 2
Ligand
BDBM50154862
Substrate
Meas. Tech.
ChEMBL_1561632 (CHEMBL3776609)
IC50
>100±n/a nM
Citation
 Micheli, FBernardelli, ABianchi, FBraggio, SCastelletti, LCavallini, PCavanni, PCremonesi, SDal Cin, MFeriani, AOliosi, BSemeraro, TTarsi, LTomelleri, SWong, AVisentini, FZonzini, LHeidbreder, C 1,2,4-Triazolyl octahydropyrrolo[2,3-b]pyrroles: A new series of potent and selective dopamine D3 receptor antagonists. Bioorg Med Chem 24:1619-36 (2016)  
Target
Name:
Potassium voltage-gated channel subfamily H member 2
Synonyms:
1,3-beta-glucan synthase component GLS2 ERG Eag-related protein 1 Ether-a-go-go-related gene (HERG) Ether-a-go-go-related gene potassium channel 1 Ether-a-go-go-related gene potassium channel 1 (hERG1) Ether-a-go-go-related protein 1 H-ERG KCNH2 Potassium voltage-gated channel subfamily H member 2 (hERG) Voltage-gated potassium channel subunit Kv11.1 hERG Potassium Channel 1 | putative potassium channel subunit
Type:
Multi-pass membrane protein
Mol. Mass.:
126672.65
Organism:
Homo sapiens (Human)
Description:
Q12809
Residue:
1159
  
Inhibitor
Name:
BDBM50154862
Synonyms:
CHEMBL3775482 US10584135, Example 163
Type:
Small organic molecule
Emp. Form.:
C23H27F3N6OS
Mol. Mass.:
492.56
SMILES:
Cc1cc(on1)-c1nnc(SCCCN2CC3CCN(C3C2)c2ccc(cc2)C(F)(F)F)n1C
: