Target
Cytochrome P450 3A4
Ligand
BDBM50154847
Substrate
Meas. Tech.
ChEMBL_1561645 (CHEMBL3776860)
IC50
>15000±n/a nM
Citation
 Micheli, FBernardelli, ABianchi, FBraggio, SCastelletti, LCavallini, PCavanni, PCremonesi, SDal Cin, MFeriani, AOliosi, BSemeraro, TTarsi, LTomelleri, SWong, AVisentini, FZonzini, LHeidbreder, C 1,2,4-Triazolyl octahydropyrrolo[2,3-b]pyrroles: A new series of potent and selective dopamine D3 receptor antagonists. Bioorg Med Chem 24:1619-36 (2016)  
Target
Name:
Cytochrome P450 3A4
Synonyms:
Albendazole monooxygenase CP3A4_HUMAN CYP3A4 CYPIIIA4 Cytochrome P450 3A4 (CYP3A4) Nifedipine oxidase Taurochenodeoxycholate 6-alpha-hydroxylase
Type:
Enzyme
Mol. Mass.:
57349.57
Organism:
Homo sapiens (Human)
Description:
Residue:
503
  
Inhibitor
Name:
BDBM50154847
Synonyms:
CHEMBL3775350 US10584135, Example 208
Type:
Small organic molecule
Emp. Form.:
C24H27F3N6OS
Mol. Mass.:
504.571
SMILES:
Cn1c(SCCCN2CC3CCN(C3C2)c2c(F)cc(F)cc2F)nnc1-c1ccn(C)c(=O)c1
: