Target
D(2) dopamine receptor
Ligand
BDBM50154851
Substrate
Meas. Tech.
ChEMBL_1561631 (CHEMBL3776608)
Ki
158±n/a nM
Citation
 Micheli, FBernardelli, ABianchi, FBraggio, SCastelletti, LCavallini, PCavanni, PCremonesi, SDal Cin, MFeriani, AOliosi, BSemeraro, TTarsi, LTomelleri, SWong, AVisentini, FZonzini, LHeidbreder, C 1,2,4-Triazolyl octahydropyrrolo[2,3-b]pyrroles: A new series of potent and selective dopamine D3 receptor antagonists. Bioorg Med Chem 24:1619-36 (2016)  
Target
Name:
D(2) dopamine receptor
Synonyms:
D(2) dopamine receptor DOPAMINE D2 Long DRD2 Dopamine D2 receptor Dopamine D2 receptor (D2R) Dopamine2-like | d2
Type:
Cell-surface receptors
Mol. Mass.:
50647.10
Organism:
Homo sapiens (Human)
Description:
P14416
Residue:
443
  
Inhibitor
Name:
BDBM50154851
Synonyms:
CHEMBL3774683 US10584135, Example 89
Type:
Small organic molecule
Emp. Form.:
C23H26F3N7S
Mol. Mass.:
489.56
SMILES:
Cn1c(SCCCN2CC3CCN(C3C2)c2ccc(cc2)C(F)(F)F)nnc1-c1cnccn1
: