Target
Tubulin beta chain
Ligand
BDBM50154910
Substrate
Meas. Tech.
ChEMBL_1562114 (CHEMBL3779656)
IC50
1010±n/a nM
Citation
 Kumar, GBNayak, VLSayeed, IBReddy, VSShaik, ABMahesh, RBaig, MFShareef, MARavikumar, AKamal, A Design, synthesis of phenstatin/isocombretastatin-oxindole conjugates as antimitotic agents. Bioorg Med Chem 24:1729-40 (2016)  
Target
Name:
Tubulin beta chain
Synonyms:
Beta-tubulin Tubulin beta chain
Type:
PROTEIN
Mol. Mass.:
49840.26
Organism:
Sus scrofa
Description:
ChEMBL_105107
Residue:
445
  
Inhibitor
Name:
BDBM50154910
Synonyms:
CHEMBL3775353
Type:
Small organic molecule
Emp. Form.:
C26H22FNO6
Mol. Mass.:
463.4544
SMILES:
COc1ccc(cc1\C=C1\C(=O)Nc2ccc(F)cc12)C(=O)c1cc(OC)c(OC)c(OC)c1
: