Target
Cyclin-dependent kinase 8
Ligand
BDBM50154940
Substrate
Meas. Tech.
ChEMBL_1562015 (CHEMBL3779189)
IC50
13±n/a nM
Citation
 Schiemann, KMallinger, AWienke, DEsdar, CPoeschke, OBusch, MRohdich, FEccles, SASchneider, RRaynaud, FICzodrowski, PMusil, DSchwarz, DUrbahns, KBlagg, J Discovery of potent and selective CDK8 inhibitors from an HSP90 pharmacophore. Bioorg Med Chem Lett 26:1443-51 (2016)  
Target
Name:
Cyclin-dependent kinase 8
Synonyms:
CDK8 Cell division protein kinase 8 Mediator complex subunit CDK8 Protein kinase K35
Type:
Serine/threonine-protein kinase
Mol. Mass.:
53300.21
Organism:
Homo sapiens (Human)
Description:
P49336
Residue:
464
  
Inhibitor
Name:
BDBM50154940
Synonyms:
CHEMBL3775384
Type:
Small organic molecule
Emp. Form.:
C24H25N5O
Mol. Mass.:
399.4882
SMILES:
Cn1cc(cn1)-c1ccc(Cc2n[nH]c3ccc(cc23)C(=O)N2CCCCC2)cc1
: