Target
Cyclin-C
Ligand
BDBM50154954
Substrate
Meas. Tech.
ChEMBL_1562017 (CHEMBL3779191)
IC50
180±n/a nM
Citation
 Schiemann, KMallinger, AWienke, DEsdar, CPoeschke, OBusch, MRohdich, FEccles, SASchneider, RRaynaud, FICzodrowski, PMusil, DSchwarz, DUrbahns, KBlagg, J Discovery of potent and selective CDK8 inhibitors from an HSP90 pharmacophore. Bioorg Med Chem Lett 26:1443-51 (2016)  
Target
Name:
Cyclin-C
Synonyms:
CCNC Cyclin C hSRB11
Type:
PROTEIN
Mol. Mass.:
33244.88
Organism:
Homo sapiens (Human)
Description:
ChEMBL_107900
Residue:
283
  
Inhibitor
Name:
BDBM50154954
Synonyms:
CHEMBL3774509
Type:
Small organic molecule
Emp. Form.:
C21H21N5O2S
Mol. Mass.:
407.489
SMILES:
Cn1cc(cn1)-c1ccc(Cc2n[nH]c3ccc(cc23)S(=O)(=O)NC2CC2)cc1
: