Target
Cyclin-C
Ligand
BDBM50154956
Substrate
Meas. Tech.
ChEMBL_1562017 (CHEMBL3779191)
IC50
2.0±n/a nM
Citation
 Schiemann, KMallinger, AWienke, DEsdar, CPoeschke, OBusch, MRohdich, FEccles, SASchneider, RRaynaud, FICzodrowski, PMusil, DSchwarz, DUrbahns, KBlagg, J Discovery of potent and selective CDK8 inhibitors from an HSP90 pharmacophore. Bioorg Med Chem Lett 26:1443-51 (2016)  
Target
Name:
Cyclin-C
Synonyms:
CCNC Cyclin C hSRB11
Type:
PROTEIN
Mol. Mass.:
33244.88
Organism:
Homo sapiens (Human)
Description:
ChEMBL_107900
Residue:
283
  
Inhibitor
Name:
BDBM50154956
Synonyms:
CHEMBL3775317
Type:
Small organic molecule
Emp. Form.:
C23H23N5O2
Mol. Mass.:
401.461
SMILES:
Cn1cc(cn1)-c1ccc(Cc2n[nH]c3ccc(cc23)C(=O)N2CC[C@@H](O)C2)cc1
: