Target
Cyclin-C
Ligand
BDBM50154961
Substrate
Meas. Tech.
ChEMBL_1562017 (CHEMBL3779191)
IC50
7.0±n/a nM
Citation
 Schiemann, KMallinger, AWienke, DEsdar, CPoeschke, OBusch, MRohdich, FEccles, SASchneider, RRaynaud, FICzodrowski, PMusil, DSchwarz, DUrbahns, KBlagg, J Discovery of potent and selective CDK8 inhibitors from an HSP90 pharmacophore. Bioorg Med Chem Lett 26:1443-51 (2016)  
Target
Name:
Cyclin-C
Synonyms:
CCNC Cyclin C hSRB11
Type:
PROTEIN
Mol. Mass.:
33244.88
Organism:
Homo sapiens (Human)
Description:
ChEMBL_107900
Residue:
283
  
Inhibitor
Name:
BDBM50154961
Synonyms:
CHEMBL3774959
Type:
Small organic molecule
Emp. Form.:
C21H21N5O2
Mol. Mass.:
375.4237
SMILES:
COC1CN(C1)C(=O)c1ccc2[nH]nc(Cc3ccc4n(C)ncc4c3)c2c1
: