Target
5-hydroxytryptamine receptor 2B
Ligand
BDBM28582
Substrate
Meas. Tech.
ChEMBL_1559793 (CHEMBL3779746)
IC50
2.5±n/a nM
Citation
 Waszkielewicz, AMGunia-Krzyzak, APowroznik, BSloczynska, KPekala, EWalczak, MBednarski, MZeslawska, ENitek, WMarona, H Design, physico-chemical properties and biological evaluation of some new N-[(phenoxy)alkyl]- and N-{2-[2-(phenoxy)ethoxy]ethyl}aminoalkanols as anticonvulsant agents. Bioorg Med Chem 24:1793-810 (2016)  
Target
Name:
5-hydroxytryptamine receptor 2B
Synonyms:
5-HT-2B 5-hydroxytryptamine (serotonin) receptor 2B [Homo sapiens] 5-hydroxytryptamine receptor 2C (5HT2C) HTR2B Serotonin 2b (5-HT2b) receptor | Serotonin Receptor 2B
Type:
G Protein-Coupled Receptor (GPCR)
Mol. Mass.:
54312.47
Organism:
Homo sapiens (Human)
Description:
Receptor binding assays were performed using human clone stably expressed in CHO cells.
Residue:
481
  
Inhibitor
Name:
BDBM28582
Synonyms:
1-(4-iodo-2,5-dimethoxyphenyl)propan-2-amine DOI DOI,(-) [125I]4-iodo-2,5-dimethoxyphenylisopropylamine | [125I]DOI
Type:
radiolabeled ligand
Emp. Form.:
C11H16INO2
Mol. Mass.:
321.1547
SMILES:
COc1cc(CC(C)N)c(OC)cc1I
: