Target
Lysine-specific demethylase 6A
Ligand
BDBM50155505
Substrate
Meas. Tech.
ChEBML_1565736
IC50
>2500±n/a nM
Citation
 Abdel-Magid, AF Inhibition of Histone Demethylases Offers a Novel and Promising Approach for the Treatment of Cancer and Other Diseases. ACS Med Chem Lett 7:128-30 (2016)  
Target
Name:
Lysine-specific demethylase 6A
Synonyms:
Histone demethylase UTX KDM6A_HUMAN Lysine-specific demethylase 6A (KDM6A(UTX)) UTX Ubiquitously-transcribed X chromosome tetratricopeptide repeat protein
Type:
Protein
Mol. Mass.:
154198.48
Organism:
Homo sapiens (Human)
Description:
O15550
Residue:
1401
  
Inhibitor
Name:
BDBM50155505
Synonyms:
CHEMBL3781414
Type:
Small organic molecule
Emp. Form.:
C14H19N3O3
Mol. Mass.:
277.319
SMILES:
CCN1CCC(CNCc2cc(ccn2)C(O)=O)C1=O
: