Target
Histone lysine demethylase PHF8
Ligand
BDBM50155449
Substrate
Meas. Tech.
ChEBML_1565735
IC50
<250±n/a nM
Citation
 Abdel-Magid, AF Inhibition of Histone Demethylases Offers a Novel and Promising Approach for the Treatment of Cancer and Other Diseases. ACS Med Chem Lett 7:128-30 (2016)  
Target
Name:
Histone lysine demethylase PHF8
Synonyms:
Histone lysine demethylase PHF8 KIAA1111 PHD finger protein 8 PHF8_HUMAN | ZNF422
Type:
Protein
Mol. Mass.:
117889.91
Organism:
Homo sapiens (Human)
Description:
Q9UPP1
Residue:
1060
  
Inhibitor
Name:
BDBM50155449
Synonyms:
CHEMBL3780958
Type:
Small organic molecule
Emp. Form.:
C22H27N3O4
Mol. Mass.:
397.4675
SMILES:
COc1ccc(cc1)[C@@H](C)N1CCC[C@@H](CNCc2cc(ccn2)C(O)=O)C1=O
: