Target
Lysine-specific histone demethylase 2
Ligand
BDBM50155764
Substrate
Meas. Tech.
ChEMBL_1564918 (CHEMBL3782875)
IC50
11600±n/a nM
Citation
 Vianello, PBotrugno, OACappa, ADal Zuffo, RDessanti, PMai, AMarrocco, BMattevi, AMeroni, GMinucci, SStazi, GThaler, FTrifiró, PValente, SVilla, MVarasi, MMercurio, C Discovery of a Novel Inhibitor of Histone Lysine-Specific Demethylase 1A (KDM1A/LSD1) as Orally Active Antitumor Agent. J Med Chem 59:1501-17 (2016)  
Target
Name:
Lysine-specific histone demethylase 2
Synonyms:
AOF1 Flavin-containing amine oxidase domain-containing protein 1 KDM1B_HUMAN Lysine-specific histone demethylase 1B | Lysine-specific histone demethylase 2
Type:
PROTEIN
Mol. Mass.:
92112.91
Organism:
Homo sapiens (Human)
Description:
ChEMBL_992590
Residue:
822
  
Inhibitor
Name:
BDBM50155764
Synonyms:
CHEMBL3780674
Type:
Small organic molecule
Emp. Form.:
C24H24ClN3O3
Mol. Mass.:
437.919
SMILES:
Cl.N[C@@H]1C[C@H]1c1ccc(NC(=O)c2cccc(NC(=O)OCc3ccccc3)c2)cc1
: