Target
Lysine-specific histone demethylase 2
Ligand
BDBM50155771
Substrate
Meas. Tech.
ChEMBL_1564918 (CHEMBL3782875)
IC50
4300±n/a nM
Citation
 Vianello, PBotrugno, OACappa, ADal Zuffo, RDessanti, PMai, AMarrocco, BMattevi, AMeroni, GMinucci, SStazi, GThaler, FTrifiró, PValente, SVilla, MVarasi, MMercurio, C Discovery of a Novel Inhibitor of Histone Lysine-Specific Demethylase 1A (KDM1A/LSD1) as Orally Active Antitumor Agent. J Med Chem 59:1501-17 (2016)  
Target
Name:
Lysine-specific histone demethylase 2
Synonyms:
AOF1 Flavin-containing amine oxidase domain-containing protein 1 KDM1B_HUMAN Lysine-specific histone demethylase 1B | Lysine-specific histone demethylase 2
Type:
PROTEIN
Mol. Mass.:
92112.91
Organism:
Homo sapiens (Human)
Description:
ChEMBL_992590
Residue:
822
  
Inhibitor
Name:
BDBM50155771
Synonyms:
CHEMBL3781560
Type:
Small organic molecule
Emp. Form.:
C29H35Cl2N5O3
Mol. Mass.:
572.526
SMILES:
Cl.Cl.CN1CCN(CC1)c1ccc(cc1NC(=O)OCc1ccccc1)C(=O)Nc1ccc(cc1)[C@@H]1C[C@H]1N
: