Target
G-protein coupled receptor 55
Ligand
BDBM50156107
Substrate
Meas. Tech.
ChEMBL_1563021 (CHEMBL3783503)
EC50
0.600000±n/a nM
Citation
 Morales, PWhyte, LSChicharro, RGómez-Cañas, MPazos, MRGoya, PIrving, AJFernández-Ruiz, JRoss, RAJagerovic, N Identification of Novel GPR55 Modulators Using Cell-Impedance-Based Label-Free Technology. J Med Chem 59:1840-53 (2016)  
Target
Name:
G-protein coupled receptor 55
Synonyms:
G protein-coupled receptor 55 GPR55_HUMAN
Type:
PROTEIN
Mol. Mass.:
36649.72
Organism:
Homo sapiens (Human)
Description:
ChEMBL_1292265
Residue:
319
  
Inhibitor
Name:
BDBM50156107
Synonyms:
CHEMBL3779969
Type:
Small organic molecule
Emp. Form.:
C26H30N4O3
Mol. Mass.:
446.5414
SMILES:
COc1ccc2-c3nn(CCN4CCN(CC4)C(=O)c4ccccc4)cc3C(C)(C)Oc2c1
: