Target
Mitogen-activated protein kinase 12
Ligand
BDBM50156160
Substrate
Meas. Tech.
ChEMBL_1563502 (CHEMBL3783187)
IC50
352±n/a nM
Citation
 Onions, STIto, KCharron, CEBrown, RJColucci, MFrickel, FHardy, GJoly, KKing-Underwood, JKizawa, YKnowles, IMurray, PJNovak, ARani, ARapeport, GSmith, AStrong, PTaddei, DMWilliams, JG Discovery of Narrow Spectrum Kinase Inhibitors: New Therapeutic Agents for the Treatment of COPD and Steroid-Resistant Asthma. J Med Chem 59:1727-46 (2016)  
Target
Name:
Mitogen-activated protein kinase 12
Synonyms:
ERK6 MAPK12 Mitogen-activated protein kinase 12 (MAPK12 p38 gamma) Mitogen-activated protein kinase 12 Gamma SAPK3 | p38 delta/gamma
Type:
Protein
Mol. Mass.:
41938.69
Organism:
Homo sapiens (Human)
Description:
P53778
Residue:
367
  
Inhibitor
Name:
BDBM50156160
Synonyms:
CHEMBL3780667
Type:
Small organic molecule
Emp. Form.:
C37H41N7O4
Mol. Mass.:
647.7659
SMILES:
Cc1ccc(cc1)-n1nc(cc1NC(=O)Nc1ccc(OCc2ccnc(NC(=O)CN3CCOCC3)c2)c2ccccc12)C(C)(C)C
: