Target
Phosphatidylinositol 4,5-bisphosphate 3-kinase catalytic subunit delta isoform
Ligand
BDBM50156298
Substrate
Meas. Tech.
ChEMBL_1563940 (CHEMBL3784756)
IC50
740±n/a nM
Citation
 Honda, AHarrington, ECornella-Taracido, IFuret, PKnapp, MSGlick, MTriantafellow, EDowdle, WEWiedershain, DManiara, WMoore, CFinan, PMHamann, LGFirestone, BMurphy, LOKeaney, EP Potent, Selective, and Orally Bioavailable Inhibitors of VPS34 Provide Chemical Tools to Modulate Autophagy in Vivo. ACS Med Chem Lett 7:72-6 (2016)  
Target
Name:
Phosphatidylinositol 4,5-bisphosphate 3-kinase catalytic subunit delta isoform
Synonyms:
PI3-kinase p110 subunit delta PI3-kinase subunit p110-delta PIK3CD Phosphatidylinositol 4,5-biphosphate 3-kinase catalytic subunit delta (PIK3CD) Phosphatidylinositol 4,5-bisphosphate 3-kinase 110 kDa catalytic subunit delta (PI3K delta) Phosphatidylinositol 4,5-bisphosphate 3-kinase catalytic subunit delta (PI3Kdelta) Phosphatidylinositol 4,5-bisphosphate 3-kinase catalytic subunit delta isoform (PI3K delta) Phosphatidylinositol 4,5-bisphosphate 3-kinase catalytic subunit delta isoform (PI3K-delta) Phosphatidylinositol 4,5-bisphosphate 3-kinase catalytic subunit delta isoform (PI3Kdelta)
Type:
Enzyme Subunit
Mol. Mass.:
119489.41
Organism:
Homo sapiens (Human)
Description:
O00329
Residue:
1044
  
Inhibitor
Name:
BDBM50156298
Synonyms:
CHEMBL3781926
Type:
Small organic molecule
Emp. Form.:
C21H25N7
Mol. Mass.:
375.4701
SMILES:
CC(C)(C)Nc1ncc(c(CC2CC2)n1)-c1ccnc(Nc2ccncc2)n1
: