Target
Serine/threonine-protein kinase N2
Ligand
BDBM50157880
Substrate
Meas. Tech.
ChEMBL_1565912 (CHEMBL3790301)
IC50
2400±n/a nM
Citation
 Fairhurst, RAMarsilje, THStutz, SBoos, ANiklaus, MChen, BJiang, SLu, WFuret, PMcCarthy, CStauffer, FGuagnano, VVaupel, AMichellys, PYSchnell, CJeay, S Optimisation of a 5-[3-phenyl-(2-cyclic-ether)-methyl-ether]-4-aminopyrrolopyrimidine series of IGF-1R inhibitors. Bioorg Med Chem Lett 26:2057-64 (2016)  
Target
Name:
Serine/threonine-protein kinase N2
Synonyms:
PKN2 PRK2 Protein kinase C-like 2 Protein-kinase C-related kinase 2 | Serine/threonine-protein kinase N2
Type:
PROTEIN
Mol. Mass.:
112029.78
Organism:
Homo sapiens (Human)
Description:
ChEMBL_1433151
Residue:
984
  
Inhibitor
Name:
BDBM50157880
Synonyms:
CHEMBL3787112
Type:
Small organic molecule
Emp. Form.:
C20H23N5O
Mol. Mass.:
349.4295
SMILES:
Nc1ncnc2n(cc(-c3cccc(O)c3)c12)[C@@H]1C[C@H](CN2CCC2)C1
: