Target
CREB-binding protein
Ligand
BDBM50151661
Substrate
Meas. Tech.
ChEBML_1569631
IC50
323±n/a nM
Citation
 Romero, FATaylor, AMCrawford, TDTsui, VCôté, AMagnuson, S Disrupting Acetyl-Lysine Recognition: Progress in the Development of Bromodomain Inhibitors. J Med Chem 59:1271-98 (2016)  
Target
Name:
CREB-binding protein
Synonyms:
CBP CREB-binding protein (CBP) CREBBP
Type:
Transcription Coactivator
Mol. Mass.:
265411.66
Organism:
Homo sapiens (Human)
Description:
Q92793
Residue:
2442
  
Inhibitor
Name:
BDBM50151661
Synonyms:
CHEMBL3752296
Type:
Small organic molecule
Emp. Form.:
C23H28N4O3
Mol. Mass.:
408.4934
SMILES:
COc1ccc2CCCN(CCCNC(=O)c3cccc4NC(=O)[C@@H](C)Nc34)c2c1
: