Target
Bromodomain-containing protein 4
Ligand
BDBM215738
Substrate
Meas. Tech.
ChEBML_1569661
IC50
8±n/a nM
Citation
 Romero, FATaylor, AMCrawford, TDTsui, VCôté, AMagnuson, S Disrupting Acetyl-Lysine Recognition: Progress in the Development of Bromodomain Inhibitors. J Med Chem 59:1271-98 (2016)  
Target
Name:
Bromodomain-containing protein 4
Synonyms:
BRD4 Bromodomain-containing protein 4 (BRD4) Protein HUNK1
Type:
Protein
Mol. Mass.:
152264.84
Organism:
Homo sapiens (Human)
Description:
O60885
Residue:
1362
  
Inhibitor
Name:
BDBM215738
Synonyms:
US9296748, II-25
Type:
Small organic molecule
Emp. Form.:
C25H27N5O2
Mol. Mass.:
429.5142
SMILES:
C[C@@H](c1ccccc1)n1c(nc2cnc(cc12)C1CCOCC1)-c1cc(C)c(=O)n(C)n1
: