Target
ALK tyrosine kinase receptor
Ligand
BDBM50159539
Substrate
Meas. Tech.
ChEMBL_1568745 (CHEMBL3791910)
IC50
2±n/a nM
Citation
 Zhang, PDong, JZhong, BZhang, DYuan, HJin, CXu, XLi, HZhou, YLiang, ZJi, MXu, TSong, GZhang, LChen, GMeng, XSun, DShih, JZhang, RHou, GWang, CJin, YYang, Q Design and synthesis of novel 3-sulfonylpyrazol-4-amino pyrimidines as potent anaplastic lymphoma kinase (ALK) inhibitors. Bioorg Med Chem Lett 26:1910-8 (2016)  
Target
Name:
ALK tyrosine kinase receptor
Synonyms:
ALK ALK_HUMAN CD_antigen: CD246
Type:
Protein
Mol. Mass.:
176453.10
Organism:
Homo sapiens (Human)
Description:
Q9UM73
Residue:
1620
  
Inhibitor
Name:
BDBM50159539
Synonyms:
CHEMBL3787598
Type:
Small organic molecule
Emp. Form.:
C27H36FN7O3S
Mol. Mass.:
557.683
SMILES:
CC(C)S(=O)(=O)c1nn(C)cc1Nc1nc(Nc2cc(C)c(cc2OC2CC2)C2CCN(C)CC2)ncc1F
: