Target
Transient receptor potential cation channel subfamily A member 1
Ligand
BDBM50157709
Substrate
Meas. Tech.
ChEMBL_1569211 (CHEMBL3791635)
IC50
55±n/a nM
Citation
 Schenkel, LBOlivieri, PRBoezio, AADeak, HLEmkey, RGraceffa, RFGunaydin, HGuzman-Perez, ALee, JHTeffera, YWang, WYoungblood, BDYu, VLZhang, MGavva, NRLehto, SGGeuns-Meyer, S Optimization of a Novel Quinazolinone-Based Series of Transient Receptor Potential A1 (TRPA1) Antagonists Demonstrating Potent in Vivo Activity. J Med Chem 59:2794-809 (2016)  
Target
Name:
Transient receptor potential cation channel subfamily A member 1
Synonyms:
Anktm1 Trpa1
Type:
PROTEIN
Mol. Mass.:
128622.74
Organism:
Rattus norvegicus
Description:
ChEMBL_1450487
Residue:
1125
  
Inhibitor
Name:
BDBM50157709
Synonyms:
CHEMBL3786508
Type:
Small organic molecule
Emp. Form.:
C18H15ClN6O2
Mol. Mass.:
382.804
SMILES:
C\C(=C/c1noc(Cn2cnc3ncn(C)c3c2=O)n1)c1ccc(Cl)cc1
: