Target
Carbonic anhydrase
Ligand
BDBM50158523
Substrate
Meas. Tech.
ChEMBL_1566138 (CHEMBL3787807)
Ki
92±n/a nM
Citation
 Akdemir, AGüzel-Akdemir, ÖKarali, NSupuran, CT Isatin analogs as novel inhibitors of Candida spp.ß-carbonic anhydrase enzymes. Bioorg Med Chem 24:1648-52 (2016)  
Target
Name:
Carbonic anhydrase
Synonyms:
CAN_CANAL beta-Carbonic Anhydrase
Type:
Enzyme
Mol. Mass.:
31587.59
Organism:
Candida albicans (Yeast)
Description:
Residue:
281
  
Inhibitor
Name:
BDBM50158523
Synonyms:
CHEMBL3787489
Type:
Small organic molecule
Emp. Form.:
C14H10FN3O3S
Mol. Mass.:
319.311
SMILES:
NS(=O)(=O)c1ccccc1\N=C1/C(=O)Nc2ccc(F)cc12
: