Target
Carbonic anhydrase
Ligand
BDBM50147211
Substrate
Meas. Tech.
ChEMBL_1566139 (CHEMBL3787808)
Ki
23±n/a nM
Citation
 Akdemir, AGüzel-Akdemir, ÖKarali, NSupuran, CT Isatin analogs as novel inhibitors of Candida spp.ß-carbonic anhydrase enzymes. Bioorg Med Chem 24:1648-52 (2016)  
Target
Name:
Carbonic anhydrase
Synonyms:
Type:
PROTEIN
Mol. Mass.:
24709.64
Organism:
Candida glabrata
Description:
ChEMBL_584597
Residue:
219
  
Inhibitor
Name:
BDBM50147211
Synonyms:
CHEMBL3765353
Type:
Small organic molecule
Emp. Form.:
C14H10N4O5S
Mol. Mass.:
346.318
SMILES:
NS(=O)(=O)c1ccc(cc1)\N=C1/C(=O)Nc2ccc(cc12)[N+]([O-])=O
: