Target
Carbonic anhydrase 1
Ligand
BDBM50158514
Substrate
Meas. Tech.
ChEMBL_1566136 (CHEMBL3787805)
Ki
375±n/a nM
Citation
 Akdemir, AGüzel-Akdemir, ÖKarali, NSupuran, CT Isatin analogs as novel inhibitors of Candida spp.ß-carbonic anhydrase enzymes. Bioorg Med Chem 24:1648-52 (2016)  
Target
Name:
Carbonic anhydrase 1
Synonyms:
CA-I CAB Carbonate dehydratase I Carbonic anhydrase 1 (CA I) Carbonic anhydrase 1 (Recombinant CA I) Carbonic anhydrase B Carbonic anhydrase I (CA I) Carbonic anhydrase I (CAI) Carbonic anhydrase isoenzyme I (hCA I) | hCA
Type:
Enzyme
Mol. Mass.:
28873.37
Organism:
Homo sapiens (Human)
Description:
P00915
Residue:
261
  
Inhibitor
Name:
BDBM50158514
Synonyms:
CHEMBL3786724
Type:
Small organic molecule
Emp. Form.:
C14H10FN3O3S
Mol. Mass.:
319.311
SMILES:
NS(=O)(=O)c1ccc(cc1)\N=C1/C(=O)Nc2ccc(F)cc12
: