Target
Egl nine homolog 1
Ligand
BDBM50158849
Substrate
Meas. Tech.
ChEMBL_1566051 (CHEMBL3791438)
IC50
96000±n/a nM
Citation
 McAllister, TEEngland, KSHopkinson, RJBrennan, PEKawamura, ASchofield, CJ Recent Progress in Histone Demethylase Inhibitors. J Med Chem 59:1308-29 (2016)  
Target
Name:
Egl nine homolog 1
Synonyms:
C1orf12 EGLN1_HUMAN Hypoxia-inducible factor prolyl hydroxylase 2 (HIF-PH2) Prolyl hydroxylase domain-containing protein 2 (PHD2)
Type:
Protein
Mol. Mass.:
46035.59
Organism:
Homo sapiens (Human)
Description:
Q9GZT9
Residue:
426
  
Inhibitor
Name:
BDBM50158849
Synonyms:
CHEMBL3785164
Type:
Small organic molecule
Emp. Form.:
C22H17ClN2O2S
Mol. Mass.:
408.901
SMILES:
Cc1ccsc1C(NC(=O)c1ccccc1)c1cc(Cl)c2cccnc2c1O
: