Target
Lysine-specific demethylase 5A
Ligand
BDBM50158621
Substrate
Meas. Tech.
ChEMBL_1566305 (CHEMBL3788932)
IC50
100±n/a nM
Citation
 McAllister, TEEngland, KSHopkinson, RJBrennan, PEKawamura, ASchofield, CJ Recent Progress in Histone Demethylase Inhibitors. J Med Chem 59:1308-29 (2016)  
Target
Name:
Lysine-specific demethylase 5A
Synonyms:
Histone demethylase JARID1A Jumonji/ARID domain-containing protein 1A KDM5A_HUMAN RBBP-2 RBP2 | Retinoblastoma-binding protein 2
Type:
Protein
Mol. Mass.:
192091.79
Organism:
Homo sapiens (Human)
Description:
P29375
Residue:
1690
  
Inhibitor
Name:
BDBM50158621
Synonyms:
CHEMBL3785421
Type:
Small organic molecule
Emp. Form.:
C16H10ClF3N2O4
Mol. Mass.:
386.71
SMILES:
OC(=O)c1ccnc2cc(OCc3ccc(Cl)c(OC(F)(F)F)c3)[nH]c12
: