Target
Lysine-specific demethylase 3A
Ligand
BDBM50158858
Substrate
Meas. Tech.
ChEMBL_1566328 (CHEMBL3789207)
IC50
>2500±n/a nM
Citation
 McAllister, TEEngland, KSHopkinson, RJBrennan, PEKawamura, ASchofield, CJ Recent Progress in Histone Demethylase Inhibitors. J Med Chem 59:1308-29 (2016)  
Target
Name:
Lysine-specific demethylase 3A
Synonyms:
JHDM2A JMJD1A Jumonji domain-containing protein 1A KDM3A_HUMAN Lysine-specific demethylase 3A (KDM3A) | TSGA
Type:
PROTEIN
Mol. Mass.:
147368.22
Organism:
Homo sapiens (Human)
Description:
Q9Y4C1
Residue:
1321
  
Inhibitor
Name:
BDBM50158858
Synonyms:
CHEMBL3786409
Type:
Small organic molecule
Emp. Form.:
C17H26F3N5O2
Mol. Mass.:
389.4158
SMILES:
CCN(CCN(C)C)C(=O)CNCc1cc(CNC(=O)C(F)(F)F)ccn1
: