Target
Lysine-specific demethylase 5B
Ligand
BDBM50158860
Substrate
Meas. Tech.
ChEMBL_1566333 (CHEMBL3789212)
IC50
<250±n/a nM
Citation
 McAllister, TEEngland, KSHopkinson, RJBrennan, PEKawamura, ASchofield, CJ Recent Progress in Histone Demethylase Inhibitors. J Med Chem 59:1308-29 (2016)  
Target
Name:
Lysine-specific demethylase 5B
Synonyms:
CT31 Histone demethylase JARID1B Jumonji/ARID domain-containing protein 1B KDM5B_HUMAN Lysine-specific demethylase 5B (KDM5Flag-5B-FL) PLU1 RBP2-H1 | Retinoblastoma-binding protein 2 homolog 1
Type:
Protein
Mol. Mass.:
175659.67
Organism:
Homo sapiens (Human)
Description:
Q9UGL1
Residue:
1544
  
Inhibitor
Name:
BDBM50158860
Synonyms:
CHEMBL3785378
Type:
Small organic molecule
Emp. Form.:
C15H21N3O3
Mol. Mass.:
291.3455
SMILES:
CCN1CCC[C@H](CNCc2cc(ccn2)C(O)=O)C1=O
: