Target
Lysine-specific demethylase 6B
Ligand
BDBM50158858
Substrate
Meas. Tech.
ChEMBL_1566336 (CHEMBL3789215)
IC50
>2500±n/a nM
Citation
 McAllister, TEEngland, KSHopkinson, RJBrennan, PEKawamura, ASchofield, CJ Recent Progress in Histone Demethylase Inhibitors. J Med Chem 59:1308-29 (2016)  
Target
Name:
Lysine-specific demethylase 6B
Synonyms:
JMJD3 Jumonji domain-containing protein 3 KDM6B_HUMAN Lysine demethylase 6B Lysine-specific demethylase 6B (KDM6B(JMJD3)) | Lysine-specific demethylase 6B (KDM6B)
Type:
Protein
Mol. Mass.:
176672.55
Organism:
Homo sapiens (Human)
Description:
O15054
Residue:
1643
  
Inhibitor
Name:
BDBM50158858
Synonyms:
CHEMBL3786409
Type:
Small organic molecule
Emp. Form.:
C17H26F3N5O2
Mol. Mass.:
389.4158
SMILES:
CCN(CCN(C)C)C(=O)CNCc1cc(CNC(=O)C(F)(F)F)ccn1
: