Target
Sodium channel protein type 9 subunit alpha
Ligand
BDBM50158889
Substrate
Meas. Tech.
ChEMBL_1566350 (CHEMBL3789454)
IC50
5.0±n/a nM
Citation
 Blass, B Sulfonamide Compounds as Voltage Gated Sodium Channel Modulators. ACS Med Chem Lett 6:1168-70 (2015)  
Target
Name:
Sodium channel protein type 9 subunit alpha
Synonyms:
NENA Peripheral sodium channel 1 SCN9A_HUMAN Voltage-gated sodium channel subunit Nav1.7 hNE-Na
Type:
Protein
Mol. Mass.:
226375.97
Organism:
Homo sapiens (Human)
Description:
Q15858
Residue:
1988
  
Inhibitor
Name:
BDBM50158889
Synonyms:
CHEMBL3786234
Type:
Small organic molecule
Emp. Form.:
C24H22F3N3O4S2
Mol. Mass.:
537.574
SMILES:
FC(F)(F)c1ccc(O[C@@H]2CCOc3cc(ccc23)S(=O)(=O)Nc2nccs2)c(c1)C1=CCNCC1
: