Target
Metabotropic glutamate receptor 4
Ligand
BDBM50007548
Substrate
Meas. Tech.
ChEMBL_1568370 (CHEMBL3789023)
EC50
30±n/a nM
Citation
 Huynh, THErichsen, MNTora, ASGoudet, CSagot, EAssaf, ZThomsen, CBrodbeck, RStensbøl, TBBjørn-Yoshimoto, WENielsen, BPin, JPGefflaut, TBunch, L New 4-Functionalized Glutamate Analogues Are Selective Agonists at Metabotropic Glutamate Receptor Subtype 2 or Selective Agonists at Metabotropic Glutamate Receptor Group III. J Med Chem 59:914-24 (2016)  
Target
Name:
Metabotropic glutamate receptor 4
Synonyms:
GRM4_RAT Grm4 Metabotropic glutamate receptor 4 (mGlu4) mGlu4 metabotropic glutamate 4a
Type:
Enzyme
Mol. Mass.:
101849.79
Organism:
Rattus norvegicus (Rat)
Description:
P31423
Residue:
912
  
Inhibitor
Name:
BDBM50007548
Synonyms:
(S)-2-Amino-4-phosphono-butyric acid 2-Amino-3-(3,5-dioxo-[1,2,4]oxadiazolidin-2-yl)-propionic acid 2-Amino-4-phosphono-butyric acid(S-AP4) 2-amino-4-phosphonobutyric acid L-(+)-2-amino-4-phosphonobutyric acid L-AP4 | L-APB
Type:
Small organic molecule
Emp. Form.:
C4H10NO5P
Mol. Mass.:
183.0997
SMILES:
N[C@@H](CCP(O)(O)=O)C(O)=O
: