Target
Metabotropic glutamate receptor 8
Ligand
BDBM50252049
Substrate
Meas. Tech.
ChEMBL_1568373 (CHEMBL3789026)
EC50
>1000000±n/a nM
Citation
 Huynh, THErichsen, MNTora, ASGoudet, CSagot, EAssaf, ZThomsen, CBrodbeck, RStensbøl, TBBjørn-Yoshimoto, WENielsen, BPin, JPGefflaut, TBunch, L New 4-Functionalized Glutamate Analogues Are Selective Agonists at Metabotropic Glutamate Receptor Subtype 2 or Selective Agonists at Metabotropic Glutamate Receptor Group III. J Med Chem 59:914-24 (2016)  
Target
Name:
Metabotropic glutamate receptor 8
Synonyms:
GRM8_RAT Grm8 Metabotropic glutamate receptor 8 (mGlu8) glutamate receptor, metabotropic 8 precursor metabotropic glutamate 8
Type:
Enzyme
Mol. Mass.:
101886.18
Organism:
Rattus norvegicus (Rat)
Description:
P70579
Residue:
908
  
Inhibitor
Name:
BDBM50252049
Synonyms:
(1S,3R)-1-aminopentane-1,3,5-tricarboxylic acid CHEMBL482081
Type:
Small organic molecule
Emp. Form.:
C8H13NO6
Mol. Mass.:
219.1919
SMILES:
N[C@@H](C[C@@H](CCC(O)=O)C(O)=O)C(O)=O
: