Target
Scavenger receptor class B member 1
Ligand
BDBM50159529
Substrate
Meas. Tech.
ChEMBL_1569538 (CHEMBL3789894)
IC50
501±n/a nM
Citation
 Sparks, SMZhou, HGeneraux, CHarston, LMoncol, DJayawickreme, CParham, JCondreay, PRimele, T Identification of nonabsorbable inhibitors of the scavenger receptor-BI (SR-BI) for tissue-specific administration. Bioorg Med Chem Lett 26:1901-4 (2016)  
Target
Name:
Scavenger receptor class B member 1
Synonyms:
CD36 and LIMPII analogous 1 CD36L1 CLA-1 Collagen type I receptor, thrombospondin receptor-like 1 SCRB1_HUMAN SRB1
Type:
PROTEIN
Mol. Mass.:
60889.81
Organism:
Homo sapiens (Human)
Description:
ChEMBL_872680
Residue:
552
  
Inhibitor
Name:
BDBM50159529
Synonyms:
CHEMBL3787449
Type:
Small organic molecule
Emp. Form.:
C31H38F3N3O8S
Mol. Mass.:
669.709
SMILES:
[O-]C(=O)C(F)(F)F.COc1c(NC(=O)C(=O)c2ccc(OCC[N+](C)(C)C)c3ccccc23)cc(cc1NS(C)(=O)=O)C(C)(C)C
: