Target
Metabotropic glutamate receptor 1
Ligand
BDBM50127985
Substrate
Meas. Tech.
ChEBML_1569545
EC50
32±n/a nM
Citation
 Garcia-Barrantes, PMCho, HPBlobaum, ALNiswender, CMConn, PJLindsley, CW Lead optimization of the VU0486321 series of mGlu1 PAMs. Part 3. Engineering plasma stability by discovery and optimization of isoindolinone analogs. Bioorg Med Chem Lett 26:1869-72 (2016)  
Target
Name:
Metabotropic glutamate receptor 1
Synonyms:
GPRC1A GRM1_HUMAN Metabotropic Glutamate 1a | metabotropic glutamate 1
Type:
Enzyme
Mol. Mass.:
132358.19
Organism:
Homo sapiens (Human)
Description:
Q13255
Residue:
1194
  
Inhibitor
Name:
BDBM50127985
Synonyms:
CHEMBL3628113
Type:
Small organic molecule
Emp. Form.:
C20H12ClFN2O4
Mol. Mass.:
398.772
SMILES:
Cc1ccoc1C(=O)Nc1ccc(N2C(=O)c3cccc(F)c3C2=O)c(Cl)c1
: