Target
Glutamate receptor 2
Ligand
BDBM50159745
Substrate
Meas. Tech.
ChEMBL_1569741 (CHEMBL3791685)
Ki
8150±n/a nM
Citation
 Wang, SYLarsen, YNavarrete, CVJensen, AANielsen, BAl-Musaed, AFrydenvang, KKastrup, JSPickering, DSClausen, RP Tweaking Subtype Selectivity and Agonist Efficacy at (S)-2-Amino-3-(3-hydroxy-5-methyl-isoxazol-4-yl)propionic acid (AMPA) Receptors in a Small Series of BnTetAMPA Analogues. J Med Chem 59:2244-54 (2016)  
Target
Name:
Glutamate receptor 2
Synonyms:
GRIA2_RAT Glutamate receptor AMPA 2/4 Gria2
Type:
PROTEIN
Mol. Mass.:
98691.74
Organism:
Rattus norvegicus
Description:
ChEMBL_936441
Residue:
883
  
Inhibitor
Name:
BDBM50159745
Synonyms:
CHEMBL3786901
Type:
Small organic molecule
Emp. Form.:
C15H17N7O4
Mol. Mass.:
359.34
SMILES:
NCc1cccc(Cn2nnc(n2)-c2onc(O)c2C[C@H](N)C(O)=O)c1
: