Target
Glutamate receptor 2
Ligand
BDBM17657
Substrate
Meas. Tech.
ChEMBL_1569978 (CHEMBL3789126)
EC50
14700±n/a nM
Citation
 Wang, SYLarsen, YNavarrete, CVJensen, AANielsen, BAl-Musaed, AFrydenvang, KKastrup, JSPickering, DSClausen, RP Tweaking Subtype Selectivity and Agonist Efficacy at (S)-2-Amino-3-(3-hydroxy-5-methyl-isoxazol-4-yl)propionic acid (AMPA) Receptors in a Small Series of BnTetAMPA Analogues. J Med Chem 59:2244-54 (2016)  
Target
Name:
Glutamate receptor 2
Synonyms:
GRIA2_RAT Glutamate receptor AMPA 2/4 Gria2
Type:
PROTEIN
Mol. Mass.:
98691.74
Organism:
Rattus norvegicus
Description:
ChEMBL_936441
Residue:
883
  
Inhibitor
Name:
BDBM17657
Synonyms:
(2S)-2-aminopentanedioic acid D-Glutamate L-Glu L-Glutamic acid L-gluatmate
Type:
Amino Acid
Emp. Form.:
C5H9NO4
Mol. Mass.:
147.1293
SMILES:
N[C@@H](CCC(O)=O)C(O)=O
: