Target
Glutamate receptor 3
Ligand
BDBM50159745
Substrate
Meas. Tech.
ChEMBL_1569979 (CHEMBL3789127)
EC50
49700±n/a nM
Citation
 Wang, SYLarsen, YNavarrete, CVJensen, AANielsen, BAl-Musaed, AFrydenvang, KKastrup, JSPickering, DSClausen, RP Tweaking Subtype Selectivity and Agonist Efficacy at (S)-2-Amino-3-(3-hydroxy-5-methyl-isoxazol-4-yl)propionic acid (AMPA) Receptors in a Small Series of BnTetAMPA Analogues. J Med Chem 59:2244-54 (2016)  
Target
Name:
Glutamate receptor 3
Synonyms:
GRIA3_RAT Glutamate receptor 3 Glutamate-AMPA | Gria3
Type:
Enzyme Catalytic Domain
Mol. Mass.:
100383.57
Organism:
RAT
Description:
Glutamate-AMPA GRIA3 RAT::P19492
Residue:
888
  
Inhibitor
Name:
BDBM50159745
Synonyms:
CHEMBL3786901
Type:
Small organic molecule
Emp. Form.:
C15H17N7O4
Mol. Mass.:
359.34
SMILES:
NCc1cccc(Cn2nnc(n2)-c2onc(O)c2C[C@H](N)C(O)=O)c1
: