Target
Phosphatidylinositol 3-kinase catalytic subunit type 3
Ligand
BDBM50160073
Substrate
Meas. Tech.
ChEMBL_1565824 (CHEMBL3789431)
IC50
>50000±n/a nM
Citation
 Rutaganira, FUFowler, MLMcPhail, JAGelman, MANguyen, KXiong, ADornan, GLTavshanjian, BGlenn, JSShokat, KMBurke, JE Design and Structural Characterization of Potent and Selective Inhibitors of Phosphatidylinositol 4 Kinase IIIß. J Med Chem 59:1830-9 (2016)  
Target
Name:
Phosphatidylinositol 3-kinase catalytic subunit type 3
Synonyms:
BC033004 PIK3C3 Phosphatidylinositol 3-kinase catalytic subunit type 3 (PIK3C3) Phosphoinositide 3-Kinase (PI3K), Vps34 PtdIns-3-kinase type 3 hVPS34
Type:
Enzyme
Mol. Mass.:
101551.30
Organism:
Homo sapiens (Human)
Description:
Recombinant human Vps34 protein was expressed as monomeric GST-fusion and purified.
Residue:
887
  
Inhibitor
Name:
BDBM50160073
Synonyms:
CHEMBL3785694
Type:
Small organic molecule
Emp. Form.:
C18H25N3O5S2
Mol. Mass.:
427.538
SMILES:
COc1ccc(cc1S(=O)(=O)NCCO)-c1sc(NC(=O)C(C)(C)C)nc1C
: