Target
Telomerase reverse transcriptase
Ligand
BDBM50160326
Substrate
Meas. Tech.
ChEMBL_1567292 (CHEMBL3788970)
IC50
2120±n/a nM
Citation
 Wang, YCheng, FXYuan, XLTang, WJShi, JBLiao, CZLiu, XH Dihydropyrazole derivatives as telomerase inhibitors: Structure-based design, synthesis, SAR and anticancer evaluation in vitro and in vivo. Eur J Med Chem 112:231-51 (2016)  
Target
Name:
Telomerase reverse transcriptase
Synonyms:
EST2 TERT TRT
Type:
PROTEIN
Mol. Mass.:
127099.03
Organism:
Homo sapiens (Human)
Description:
ChEMBL_1447029
Residue:
1132
  
Inhibitor
Name:
BDBM50160326
Synonyms:
CHEMBL3787380
Type:
Small organic molecule
Emp. Form.:
C19H25N3O3
Mol. Mass.:
343.4201
SMILES:
CC(=O)Oc1ccccc1C1CC(C)=NN1C(=O)CN1CCCCC1
: